{"text_format":"1","workbook":"xlsx","n_sheets":15,"sheets":["Pagina iniziale","Articolo 19","Informazioni generali","Coltiv","Allev","Trasf","Commerc","Extra-Agricolo","Piano Investimenti","Particolari delle azioni","Riepilogo","Elenchi","Tabella_CREA","Codici ed effetti","Categoria investimenti"],"not_rendered":{"charts":0,"images":3,"macros":1,"external_links":0,"defined_names":20,"comments":0,"pivot_tables":0},"unopened":[],"bounds":{"document_bytes":16777216,"sheet_cells":100000,"rows_first":2000,"rows_last":500,"rows_between":2000,"halvings":0,"cell_chars":16384,"cell_head_chars":4096},"cells_cut":0,"cells_raw":0,"read":"whole","date_system":"1900"}

{"sheet":"Pagina iniziale","index":0,"n_rows":12,"n_cols":1,"rows_kept":12,"cut":false,"hidden":false,"merged":[[4,0,4,9],[6,0,6,9],[3,0,3,9]]}
[]
[]
[]
["REGIONE ABRUZZO"]
["Dipartimento Agricoltura Programma di Sviluppo Rurale 2014-2022 Reg. (UE) 1305/2013"]
[]
["M06 – SVILUPPO DELLE AZIENDE AGRICOLE E DELLE IMPRESE ARTT. 17 E 19 REG. (UE) 1305/2013     Sottomisura 6.1 – “Aiuti all’avviamento di attività imprenditoriali per i giovani agricoltori”"]
[]
{"$rows_left_out":5}
{"sheet":"Articolo 19","index":1,"n_rows":7,"n_cols":1,"rows_kept":7,"cut":false,"hidden":false,"merged":[]}
["Allegato 1 "]
[]
["REQUISITI DI AMMISSIBILITÀ DELL’INVESTIMENTO"]
["IL PIANO DI SVILUPPO AZIENDALE"]
[]
["Il Piano di Sviluppo Aziendale deve essere redatto – a pena di inammissibilità della domanda – secondo le prescrizioni di cui all’articolo 19, paragrafo 4, del Regolamento UE n. 1305/2013 e, per l’effetto, deve rappresentare i seguenti contenuti:"]
["1.          la situazione di partenza dell’azienda agricola\n2.       le tappe essenziali e gli obiettivi per lo sviluppo delle attività della nuova azienda;\n3.       i particolari delle azioni, incluse quelle inerenti alla sostenibilità ambientale e all’efficienza delle risorse, occorrenti per lo sviluppo delle attività dell’azienda agricola quali investimenti, formazione, consulenza o qualsiasi altra attività."]

{"sheet":"Informazioni generali","index":2,"n_rows":104,"n_cols":2,"rows_kept":104,"cut":false,"hidden":false,"merged":[[90,0,90,1],[101,0,101,1],[20,0,20,1],[0,0,0,1],[57,0,57,1],[87,0,88,0],[60,0,60,1],[65,0,65,1],[77,0,77,1],[82,0,82,1]]}
["1 - Anagrafica dell’azienda in cui avviene l'insediamento"]
["Ragione sociale o Denominazione sociale"]
["Costituita come"]
["Codice Fiscale/Partita Iva"]
["CUAA"]
["Sede legale"]
["Codice ATECO"]
["Oggetto sociale "]
{"$rows_left_out":97}
{"sheet":"Coltiv","index":3,"n_rows":21,"n_cols":34,"rows_kept":21,"cut":false,"hidden":false,"merged":[[17,1,20,1],[1,0,1,13],[2,0,2,13],[9,20,12,20],[13,1,16,1],[9,1,12,1],[3,9,3,11],[3,6,3,8],[3,12,3,14],[3,15,3,16]]}
["Attività di Coltivazione"]
["* il valore della produzione è equiparabile alla PLT dei processi produttivi vegetali ed animali, al netto degli aiuti pubblici.Il valore medio ponderato della produzione lorda totale corrisponde alla Produzione Standard."]
["Costi medi variabili Attività Produttive: sono ricompresi nei costi medi variabili le seguenti voci di spesa: costi delle materie prime (tra cui, a titolo esemplificativo, costi per acquisto mangimi e foraggio, concimi, fertilizzanti, produzioni reimpiegate) ; noleggi, manutenzioni; ammortamenti e accantonamenti; salari e stipendi e oneri sociali; altri costi di produzione (utenze varie, spese amministrative, consulenze agronomiche, spese veterinarie, affitti, assicurazioni, costo carburante, ecc.). Per tali costi sono state considerate una soglia minima e massima sia per l'attività di coltivazione 40%-65% della PS, sia per l'attività di allevamento 50%-75%."]
[null,null,null,null,null,null,"f) Trasformazione",null,null,"g) Commercializzazione",null,null,"h) Attività extra-agricola",null,null,"i) attività amministrativa / gestionale dell’azienda"]
["Tappa","a) Coltura","b) Ha,aa","c) Giornate Uomo","d) Costi medi variabili","e) Valore della produzione*","f1) Trasformazione","f2) Valore della produzione","f3) Giornate","g1) Commercializzazione","g2) Valore della produzione","g3) Giornate","h1) Attività extra-agricola","h2) Valore della produzione","h3) Giornate","i1) Attività amministrativa / gestionale dell’azienda","i2) Giornate"]
[{"$f":"tappa0","v":"Ex-ante"},null,{"$f":"SUMIFS(C$10:C$1032, $A10:$A1032, $A6)","v":0},{"$f":"SUMIFS(D$10:D$1032, $A10:$A1032, $A6)","v":0},{"$f":"SUMIFS(E$10:E$1032, $A10:$A1032, $A6)","v":0},{"$f":"SUMIFS(F$10:F$1032, $A10:$A1032, $A6)","v":0},null,{"$f":"SUMIFS(H$10:H$1032, $A10:$A1032, $A6)","v":0},{"$f":"SUMIFS(I$10:I$1032, $A10:$A1032, $A6)","v":0},null,{"$f":"SUMIFS(K$10:K$1032, $A10:$A1032, $A6)","v":0},{"$f":"SUMIFS(L$10:L$1032, $A10:$A1032, $A6)","v":0},null,{"$f":"SUMIFS(N$10:N$1032, $A10:$A1032, $A6)","v":0},{"$f":"SUMIFS(O$10:O$1032, $A10:$A1032, $A6)","v":0},null,{"$f":"SUMIFS(Q$10:Q$1032, $A10:$A1032, $A6)","v":0}]
[{"$f":"tappa1","v":"00/00/00"},null,{"$f":"SUMIFS(C$10:C$1032, $A10:$A1032, $A7)","v":0},{"$f":"SUMIFS(D$10:D$1032, $A10:$A1032, $A7)","v":0},{"$f":"SUMIFS(E$10:E$1032, $A10:$A1032, $A7)","v":0},{"$f":"SUMIFS(F$10:F$1032, $A10:$A1032, $A7)","v":0},null,{"$f":"SUMIFS(H$10:H$1032, $A10:$A1032, $A7)","v":0},{"$f":"SUMIFS(I$10:I$1032, $A10:$A1032, $A7)","v":0},null,{"$f":"SUMIFS(K$10:K$1032, $A10:$A1032, $A7)","v":0},{"$f":"SUMIFS(L$10:L$1032, $A10:$A1032, $A7)","v":0},null,{"$f":"SUMIFS(N$10:N$1032, $A10:$A1032, $A7)","v":0},{"$f":"SUMIFS(O$10:O$1032, $A10:$A1032, $A7)","v":0},null,{"$f":"SUMIFS(Q$10:Q$1032, $A10:$A1032, $A7)","v":0}]
[{"$f":"tappa2","v":"00/00/00"},null,{"$f":"SUMIFS(C$10:C$1032, $A10:$A1032, $A8)","v":0},{"$f":"SUMIFS(D$10:D$1032, $A10:$A1032, $A8)","v":0},{"$f":"SUMIFS(E$10:E$1032, $A10:$A1032, $A8)","v":0},{"$f":"SUMIFS(F$10:F$1032, $A10:$A1032, $A8)","v":0},null,{"$f":"SUMIFS(H$10:H$1032, $A10:$A1032, $A8)","v":0},{"$f":"SUMIFS(I$10:I$1032, $A10:$A1032, $A8)","v":0},null,{"$f":"SUMIFS(K$10:K$1032, $A10:$A1032, $A8)","v":0},{"$f":"SUMIFS(L$10:L$1032, $A10:$A1032, $A8)","v":0},null,{"$f":"SUMIFS(N$10:N$1032, $A10:$A1032, $A8)","v":0},{"$f":"SUMIFS(O$10:O$1032, $A10:$A1032, $A8)","v":0},null,{"$f":"SUMIFS(Q$10:Q$1032, $A10:$A1032, $A8)","v":0}]
{"$rows_left_out":14}
{"sheet":"Allev","index":4,"n_rows":23,"n_cols":38,"rows_kept":23,"cut":false,"hidden":false,"merged":[[8,36,12,36],[15,27,17,27],[8,38,12,38],[8,39,12,39],[13,38,17,38],[13,39,17,39],[13,36,17,36],[13,37,17,37],[8,30,12,30],[8,31,12,31],[8,32,12,32],[8,33,12,33],[8,34,12,34],[18,38,22,38],[18,39,22,39],[1,17,1,18],[18,18,22,18],[18,17,22,17],[13,18,17,18],[13,17,17,17],[8,18,12,18],[8,17,12,17],[18,35,22,35],[18,36,22,36],[18,37,22,37],[20,27,22,27],[18,30,22,30],[18,31,22,31],[18,32,22,32],[18,33,22,33],[18,34,22,34],[8,35,12,35],[18,14,22,14],[8,37,12,37],[10,27,12,27],[13,24,17,24],[13,25,17,25],[13,28,17,28],[13,29,17,29],[13,30,17,30],[13,31,17,31],[13,32,17,32],[13,33,17,33],[13,34,17,34],[13,35,17,35],[8,24,12,24],[8,25,12,25],[8,28,12,28],[8,29,12,29],[13,12,17,12],[13,15,17,15],[13,14,17,14],[8,15,12,15],[8,12,12,12],[18,24,22,24],[18,25,22,25],[18,28,22,28],[18,29,22,29],[8,3,12,3],[8,4,12,4],[18,13,22,13],[18,3,22,3],[18,4,22,4],[18,16,22,16],[20,6,22,6],[13,13,17,13],[7,22,22,22],[13,16,17,16],[15,6,17,6],[18,7,22,7],[18,11,22,11],[13,8,17,8],[13,10,17,10],[13,11,17,11],[18,9,22,9],[13,9,17,9],[13,3,17,3],[13,4,17,4],[13,7,17,7],[18,8,22,8],[18,10,22,10],[8,9,12,9],[18,15,22,15],[18,12,22,12],[0,0,0,16],[1,8,1,10],[1,11,1,13],[1,14,1,16],[7,1,22,1],[8,11,12,11],[8,8,12,8],[8,7,12,7],[10,6,12,6],[8,10,12,10],[8,13,12,13],[8,16,12,16],[8,14,12,14]]}
["Attività di Allevamento"]
[null,null,null,null,null,null,null,null,"h) Trasformazione",null,null,"i) Commercializzazione",null,null,"j) Attività extra-agricola",null,null,"i) attività amministrativa / gestionale dell’azienda"]
["Tappa","a) Razza","b) N. capi /\nettari (lumache) /\nalveari (api)","c) Consistenza media","d) Giornate Uomo","e) Costo capi acquistati","f) Costi medi variabili","g) Valore della produzione","h1) Trasformazione","h2) Valore della produzione","h3) Giornate","i1) Commercializzazione","i2) Valore della produzione","i3) Giornate","j1) Attività extra-agricola","j2) Valore della produzione","j3) Giornate","i1) Attività amministrativa / gestionale dell’azienda","i2) Giornate"]
[{"$f":"tappa0","v":"Ex-ante"},null,null,null,{"$f":"SUMIFS(E$8:E$4936, $A8:$A4936, $A4)","v":0},null,{"$f":"SUMIFS(G$8:G$4936, $A8:$A4936, $A4)","v":0},{"$f":"SUMIFS(H$8:H$4936, $A8:$A4936, $A4)","v":0},null,{"$f":"SUMIFS(J$8:J$4936, $A8:$A4936, $A4)","v":0},{"$f":"SUMIFS(K$8:K$4936, $A8:$A4936, $A4)","v":0},null,{"$f":"SUMIFS(M$8:M$4936, $A8:$A4936, $A4)","v":0},{"$f":"SUMIFS(N$8:N$4936, $A8:$A4936, $A4)","v":0},null,{"$f":"SUMIFS(P$8:P$4936, $A8:$A4936, $A4)","v":0},{"$f":"SUMIFS(Q$8:Q$4936, $A8:$A4936, $A4)","v":0},null,{"$f":"SUMIFS(S$8:S$4936, $A8:$A4936, $A4)","v":0}]
[{"$f":"tappa1","v":"00/00/00"},null,null,null,{"$f":"SUMIFS(E$8:E$4936, $A8:$A4936, $A5)","v":0},null,{"$f":"SUMIFS(G$8:G$4936, $A8:$A4936, $A5)","v":0},{"$f":"SUMIFS(H$8:H$4936, $A8:$A4936, $A5)","v":0},null,{"$f":"SUMIFS(J$8:J$4936, $A8:$A4936, $A5)","v":0},{"$f":"SUMIFS(K$8:K$4936, $A8:$A4936, $A5)","v":0},null,{"$f":"SUMIFS(M$8:M$4936, $A8:$A4936, $A5)","v":0},{"$f":"SUMIFS(N$8:N$4936, $A8:$A4936, $A5)","v":0},null,{"$f":"SUMIFS(P$8:P$4936, $A8:$A4936, $A5)","v":0},{"$f":"SUMIFS(Q$8:Q$4936, $A8:$A4936, $A5)","v":0},null,{"$f":"SUMIFS(S$8:S$4936, $A8:$A4936, $A5)","v":0}]
[{"$f":"tappa2","v":"00/00/00"},null,null,null,{"$f":"SUMIFS(E$8:E$4936, $A8:$A4936, $A6)","v":0},null,{"$f":"SUMIFS(G$8:G$4936, $A8:$A4936, $A6)","v":0},{"$f":"SUMIFS(H$8:H$4936, $A8:$A4936, $A6)","v":0},null,{"$f":"SUMIFS(J$8:J$4936, $A8:$A4936, $A6)","v":0},{"$f":"SUMIFS(K$8:K$4936, $A8:$A4936, $A6)","v":0},null,{"$f":"SUMIFS(M$8:M$4936, $A8:$A4936, $A6)","v":0},{"$f":"SUMIFS(N$8:N$4936, $A8:$A4936, $A6)","v":0},null,{"$f":"SUMIFS(P$8:P$4936, $A8:$A4936, $A6)","v":0},{"$f":"SUMIFS(Q$8:Q$4936, $A8:$A4936, $A6)","v":0},null,{"$f":"SUMIFS(S$8:S$4936, $A8:$A4936, $A6)","v":0}]
[{"$f":"tappa3","v":"00/00/00"},null,null,null,{"$f":"SUMIFS(E$8:E$4936, $A8:$A4936, $A7)","v":0},null,{"$f":"SUMIFS(G$8:G$4936, $A8:$A4936, $A7)","v":0},{"$f":"SUMIFS(H$8:H$4936, $A8:$A4936, $A7)","v":0},null,{"$f":"SUMIFS(J$8:J$4936, $A8:$A4936, $A7)","v":0},{"$f":"SUMIFS(K$8:K$4936, $A8:$A4936, $A7)","v":0},null,{"$f":"SUMIFS(M$8:M$4936, $A8:$A4936, $A7)","v":0},{"$f":"SUMIFS(N$8:N$4936, $A8:$A4936, $A7)","v":0},null,{"$f":"SUMIFS(P$8:P$4936, $A8:$A4936, $A7)","v":0},{"$f":"SUMIFS(Q$8:Q$4936, $A8:$A4936, $A7)","v":0},null,{"$f":"SUMIFS(S$8:S$4936, $A8:$A4936, $A7)","v":0}]
[{"$f":"tappa0","v":"Ex-ante"},null,null,null,{"$f":"IFERROR(VLOOKUP(B8,Tabella_CREA!$F$66:$I$93,4,FALSE)*D8,\"0\")","v":"0"},null,null,{"$f":"IFERROR(VLOOKUP(B8,Tabella_CREA!$F$66:$I$93,2,FALSE)*D8,0)","v":0},null,{"$f":"IF($I8=\"SI\",($H8)*10%,0)","v":0},{"$f":"IF($I8=\"SI\",$E8*10%,0)","v":0},null,{"$f":"IF($L8=\"SI\",$H8*10%,0)","v":0},{"$f":"IF($L8=\"SI\",$E8*10%,0)","v":0},null,{"$f":"IF($O8<>\"\",$H8*VLOOKUP($O8,Elenchi!$A$1:$B$10,2,FALSE),0)","v":0},{"$f":"IF($O8<>\"\",$E8*VLOOKUP($O8,Elenchi!$A$1:$B$10,2,FALSE),0)","v":0},null,null,null,null,{"$f":"tappa0","v":"Ex-ante"},null,null,null,{"$f":"IFERROR(VLOOKUP(W8,Tabella_CREA!$F$66:$I$93,4,FALSE)*Y8,\"0\")","v":"0"},null,null,{"$f":"IFERROR(VLOOKUP(W8,Tabella_CREA!$F$66:$I$93,2,FALSE)*Y8,0)","v":0},null,{"$f":"IF($I8=\"SI\",($H8)*10%,0)","v":0},{"$f":"IF($I8=\"SI\",$E8*10%,0)","v":0},null,{"$f":"IF($L8=\"SI\",$H8*10%,0)","v":0},{"$f":"IF($L8=\"SI\",$E8*10%,0)","v":0},null,{"$f":"IF($O8<>\"\",$H8*VLOOKUP($O8,Elenchi!$A$1:$B$10,2,FALSE),0)","v":0},{"$f":"IF($O8<>\"\",$E8*VLOOKUP($O8,Elenchi!$A$1:$B$10,2,FALSE),0)","v":0}]
{"$rows_left_out":16}
{"sheet":"Trasf","index":5,"n_rows":15,"n_cols":10,"rows_kept":15,"cut":false,"hidden":false,"merged":[[1,0,1,6],[0,0,0,6],[7,1,10,1],[7,10,10,10],[11,1,14,1]]}
["Attività di Trasformazione"]
[" Costi variabili Attività di trasformazione: tutti i costi del processo di trasformazione e della logistica aziendale, riferibili alle fasi di prima trasformazione della materia prima, imballaggio e stoccaggio del prodotto trasformato. "]
["Tappa","a) Prodotto trasformato","b) Materia prima re-impiegata (%)","c) Percentuale di trasformazione (%)","d) Quantità trasformata","e) Prezzo","f) Costi variabili di trasformazione"]
[{"$f":"tappa0","v":"Ex-ante"},null,null,null,null,null,{"$f":"SUMIFS(G$8:G$1100, $A$8:$A$1100, $A4)","v":0}]
[{"$f":"tappa1","v":"00/00/00"},null,null,null,null,null,{"$f":"SUMIFS(G$8:G$1100, $A$8:$A$1100, $A5)","v":0}]
[{"$f":"tappa2","v":"00/00/00"},null,null,null,null,null,{"$f":"SUMIFS(G$8:G$1100, $A$8:$A$1100, $A6)","v":0}]
[{"$f":"tappa3","v":"00/00/00"},null,null,null,null,null,{"$f":"SUMIFS(G$8:G$1100, $A$8:$A$1100, $A7)","v":0}]
[{"$f":"tappa0","v":"Ex-ante"},null,null,null,null,null,null,null,null,{"$f":"tappa0","v":"Ex-ante"}]
{"$rows_left_out":8}
{"sheet":"Commerc","index":6,"n_rows":15,"n_cols":8,"rows_kept":15,"cut":false,"hidden":false,"merged":[[0,0,0,4],[1,0,1,4],[7,1,10,1],[7,8,10,8],[11,1,14,1]]}
["Attività di Commercializzazione"]
["Costi Variabili Attività di Vendita: tutti i costi legati alla commercializzazione del prodotto finito, riferibili a spese per la gestione del magazzino, degli spazi e delle attività di vendita, ovvero ogni ulteriore costo direttamente collegato alla commercializzaizone sostenuto dall'azienda."]
["Tappa","a) Prodotto venduto","b) Prezzo applicato","c) Quantità venduta","d) Costi variabili di Commercializzazione"]
[{"$f":"tappa0","v":"Ex-ante"},null,null,null,{"$f":"SUMIFS(E$8:E$1100, $A$8:$A$1100, $A4)","v":0}]
[{"$f":"tappa1","v":"00/00/00"},null,null,null,{"$f":"SUMIFS(E$8:E$1100, $A$8:$A$1100, $A5)","v":0}]
[{"$f":"tappa2","v":"00/00/00"},null,null,null,{"$f":"SUMIFS(E$8:E$1100, $A$8:$A$1100, $A6)","v":0}]
[{"$f":"tappa3","v":"00/00/00"},null,null,null,{"$f":"SUMIFS(E$8:E$1100, $A$8:$A$1100, $A7)","v":0}]
[{"$f":"tappa0","v":"Ex-ante"},null,null,null,null,null,null,{"$f":"tappa0","v":"Ex-ante"}]
{"$rows_left_out":8}
{"sheet":"Extra-Agricolo","index":7,"n_rows":15,"n_cols":8,"rows_kept":15,"cut":false,"hidden":false,"merged":[[11,1,14,1],[11,2,14,2],[7,9,10,9],[0,0,0,4],[1,0,1,4],[7,2,10,2],[7,1,10,1],[7,8,10,8]]}
["Diversificazione della Attività extra-agricola "]
["Costi Variabili Attività extra-agricola: sono ricompresi tutti i costi direttamente collegabili all'espletamento dell'attività di diversificazione svolta dall'azienda. "]
["Tappa","a) Ambito di diversificazione","b) Tipologia di macchinari e attrezzature utilizzate","c) Incidenza sul Reddito complessivo (%)","d) Costi variabili dell’attività extra-agricola"]
[{"$f":"tappa0","v":"Ex-ante"},null,null,null,{"$f":"SUMIFS(E$8:E$1100, $A$8:$A$1100, $A4)","v":0}]
[{"$f":"tappa1","v":"00/00/00"},null,null,null,{"$f":"SUMIFS(E$8:E$1100, $A$8:$A$1100, $A5)","v":0}]
[{"$f":"tappa2","v":"00/00/00"},null,null,null,{"$f":"SUMIFS(E$8:E$1100, $A$8:$A$1100, $A6)","v":0}]
[{"$f":"tappa3","v":"00/00/00"},null,null,null,{"$f":"SUMIFS(E$8:E$1100, $A$8:$A$1100, $A7)","v":0}]
[{"$f":"tappa0","v":"Ex-ante"},null,null,null,null,null,null,{"$f":"tappa0","v":"Ex-ante"}]
{"$rows_left_out":8}
{"sheet":"Piano Investimenti","index":8,"n_rows":21,"n_cols":14,"rows_kept":21,"cut":false,"hidden":false,"merged":[[1,0,1,13],[2,10,2,13],[2,5,2,7],[2,9,3,9],[2,8,3,8],[2,4,3,4],[2,3,3,3],[2,2,3,2],[2,1,3,1],[7,0,7,3],[6,0,6,3],[5,0,5,3],[4,0,4,3],[2,0,3,0]]}
["Piano degli Investimenti programmati e modalità di Utilizzo del Sostegno"]
["L’anno si riferisce all’anno di acquisto del bene aziendale.\nIl codice degli investimenti viene opzionato nel menu a tendina e richiama la codificazione degli stessi riportata nell’allegato \"Codice ed Effetti\".\nLa Descrizione degli investimenti si riferisce alla funzionalità operativa del bene\nSub lettera e)  Importi indicativi (le singole voci devono restare le stesse a fine Piano così come il totale non può essere inferiore a quanto preventivato. Gli importi delle singole voci possono comunque variare rispetto alle previsioni fatte ad avvio Piano.\nSub lettera i) indicare gli Importi indicativi previsti per il totale degli investimenti al netto dell’IVA.\nSub lettera i) le mensilità riportate sono calcolate a partire dalla notifica del provvedimento di concessione. "]
["a) Anno","b) Codice","c) Descrizione","d) Individuazione del bene/servizio acquistato","e) Valore unitario di ciascun bene/servizio","f) Effetti",null,null,"g)\nT-C","h) Agricoltura 4.0 ","i) Valori di spesa in base al cronoprogramma (euro)"]
[null,null,null,null,null,"A","B","C",null,null,"i1) Mese 1","i2) Mese 18","i3) Mese 36","i4) Totale (€)"]
["Totale investimento",null,null,null,null,null,null,null,null,null,{"$f":"SUM(K9:K9997)","v":0},{"$f":"SUM(L9:L9997)","v":0},{"$f":"SUM(M9:M9997)","v":0},{"$f":"SUM(N9:N9997)","v":0}]
["Totale investimento per attuazione PSA",null,null,null,null,null,null,null,null,null,null,null,null,{"$f":"12000-Riepilogo!E30","v":12000}]
["Investimento minimo in base al numero degli insediati e all'area di appartenenza",null,null,null,null,null,null,null,null,null,null,null,null,{"$f":"IF(area=\"Area D\",\n   IF(numInsediati=1,70000,\n   IF(numInsediati=2,60000*numInsediati,\n   IF(numInsediati>=3,45000*numInsediati, 0\n   ))),\n\n   IF(numInsediati=1,60000,\n   IF(numInsediati=2,50000*numInsediati,\n   IF(numInsediati>=3,40000*numInsediati, 0\n   )))\n)","v":0}]
[{"$f":"CONCATENATE(\"Totale complessivo\", IF(N8<N7, \" (Sostegno non integralmente utilizzato)\",\"\"))","v":"Totale complessivo"},null,null,null,null,null,null,null,null,null,null,null,null,{"$f":"N5+N6+C8","v":12000}]
{"$rows_left_out":14}
{"sheet":"Particolari delle azioni","index":9,"n_rows":23,"n_cols":2,"rows_kept":23,"cut":false,"hidden":false,"merged":[[27,0,27,1],[0,0,0,1],[6,0,6,1],[11,0,11,1],[20,0,20,1],[16,0,16,1]]}
["1 - Introduzione di uno o più sistemi integrati e connessi di ICT: gestione tecnico-economica, efficientamento energetico, sostenibilità ambientale"]
["ICT","Sistema di ICT gestione economico-aziendale; efficientamento energetico, sostenibilità ambientale "]
["ICT per la gestione tecnico-economica\nSpecificare tempi e modalità di implementazione, valore aggiunto apportato al sistema di gestione tecnico-economico dell’azienda"]
["ICT per l’efficientamento energetico\nSpecificare tempi e modalità di implementazione, miglioramento energetico aziendale in relazione ai propri consumi"]
["ICT per la sostenibilità ambientale\nSpecificare tempi e modalità di implementazione, descrivere i fattori tangibili di miglioramento della sostenibilità ambientale dell’azienda"]
[]
["2 - Adesione a un sistema di certificazione"]
["Anno di azione"]
{"$rows_left_out":16}
{"sheet":"Riepilogo","index":10,"n_rows":54,"n_cols":7,"rows_kept":54,"cut":false,"hidden":false,"merged":[[44,3,44,6],[53,3,53,5],[51,4,51,6],[50,4,50,6],[49,4,49,6],[48,4,48,6],[47,4,47,6],[46,4,46,6],[45,4,45,6],[44,0,44,2],[45,1,45,2],[31,0,31,6],[37,0,37,3],[36,0,36,3],[35,0,35,3],[34,0,34,3],[33,0,33,3],[32,0,32,3],[41,0,41,3],[40,0,40,3],[39,0,39,3],[38,0,38,3],[32,4,32,6],[33,4,33,6],[34,4,34,6],[39,4,39,6],[40,4,40,6],[41,4,41,6],[36,4,36,6],[35,4,35,6],[38,4,38,6],[10,4,10,6],[11,4,11,6],[13,0,13,6],[23,0,23,6],[29,0,29,2],[26,0,26,2],[27,0,27,2],[11,1,11,3],[10,1,10,3],[28,0,28,2],[24,0,24,4],[1,1,1,3],[1,4,1,6],[0,0,0,6],[9,1,9,3],[9,4,9,6]]}
["Unità impiegate nelle attività agricole al mese 36 (inserire il numero di giornate impiegate)"]
[null,{"$f":"tappa0","v":"Ex-ante"},null,null,{"$f":"tappa3","v":"00/00/00"}]
[null,"Totale manodopera","Manodopera familiare","Manodopera extra-familiare","Totale manodopera","Manodopera familiare","Manodopera extra-familiare"]
["a) Coltivazione",{"$f":"Coltiv!$D6","v":0},null,null,{"$f":"Coltiv!$D9","v":0}]
["b) Allevamento",{"$f":"Allev!$E4","v":0},null,null,{"$f":"Allev!$E7","v":0}]
["c) Trasformazione",{"$f":"Coltiv!$I6+Allev!$K4","v":0},null,null,{"$f":"Coltiv!$I9+Allev!$K7","v":0}]
["d) Commercializzazione",{"$f":"Coltiv!$L6+Allev!$N4","v":0},null,null,{"$f":"Coltiv!$L9+Allev!$N7","v":0}]
["e) Attività extra-agricola",{"$f":"Coltiv!$O6+Allev!$Q4","v":0},null,null,{"$f":"Coltiv!$O9+Allev!$Q7","v":0}]
{"$rows_left_out":47}
{"sheet":"Elenchi","index":11,"n_rows":14,"n_cols":6,"rows_kept":14,"cut":false,"hidden":true,"merged":[]}
["Agriturismo",0.1,"Ex-ante","Società di persone","Società di capitali","Società cooperativa agricola a responsabilità limitata"]
["Fattorie didattiche/Fattorie sociali",0.1,{"$f":"'Informazioni generali'!B62","v":"00/00/00"},"Società semplice (S.s.)","Società per azioni (S.p.A.)","Società cooperativa agricola a responsabilità limitata (SCARL)"]
["Agricoltura sociale",0.1,{"$f":"'Informazioni generali'!B63","v":"00/00/00"},"Società in nome collettivo (S.n.c.)","Società a responsabilità limitata (S.r.l.)"]
["Acquacoltura",0.1,{"$f":"'Informazioni generali'!B64","v":"00/00/00"},"Società in accomandita semplice (S.a.s.)","Società semplificata a responsabilità limitata (S.s.r.l.)"]
["Turismo rurale e attività ricreative",0.05,null,null,"Società unipersonale a responsabilità limitata (s.r.l. unipersonale)"]
["Contoterzismo attivo ",0.05,null,null,"Società in accomandita per azioni (s.a.p.a.)"]
["Servizi ambientali",0.05]
["Attività sportive e ricreative",0.05]
{"$rows_left_out":7}
{"sheet":"Tabella_CREA","index":12,"n_rows":93,"n_cols":13,"rows_kept":93,"cut":false,"hidden":true,"merged":[]}
["FADN_REGION","NUTS2","Regione_P.A.","COD_PRODUCT","Rubrica_RICA","Descrizione_Rubrica","SOC_EUR","UM","GG_Ettaro"]
[292,"ITF1      ","Abruzzo","T0000T","G02","Agrumeti",6552,"EUR_per_ha",125]
[292,"ITF1      ","Abruzzo","ARA99T_ARA09S","D20","Altre colture per seminativi",1145,"EUR_per_ha",12]
[292,"ITF1      ","Abruzzo","PECR9_H9000T","G06","Altre colture permanenti",1860,"EUR_per_ha",18]
[292,"ITF1      ","Abruzzo","X0000T","G06","Altre colture permanenti - Alberi di Natale",1860,"EUR_per_ha",18]
[292,"ITF1      ","Abruzzo","I2900T","D33","Altre colture tessili",1152,"EUR_per_ha",12]
[292,"ITF1      ","Abruzzo","G9100T_G9900T","D18B","Altre foraggere avvicendate",444,"EUR_per_ha",18]
[292,"ITF1      ","Abruzzo","G2000T","D18D","Altre foraggere: Leguminose",467,"EUR_per_ha",18]
{"$rows_left_out":86}
{"sheet":"Codici ed effetti","index":13,"n_rows":41,"n_cols":7,"rows_kept":41,"cut":false,"hidden":true,"merged":[[0,0,0,6],[1,4,1,6],[1,0,1,3]]}
["TABELLA DI CORRISPONDENZA TRA TIPOLOGIA DI INVESTIMENTI ED EFFETTI"]
["Tipologia",null,null,null,"Effetti"]
["Categoria","Codice","Descrizione","Codice","A-Qualità dell'ambiente","B - Rendimento economico","C - Qualità delle produzioni"]
[1,1,"Acquisto terreni (°)",1,null,"X"]
[2,2,"Sistemazioni idraulico agrarie",2,"X","X"]
[2,3,"Drenaggi e opere di canalizzazione dell’acqua",3,"X","X","X"]
[2,4,"Impianti per la gestione efficiente dell'acqua di irrigazione",4,"X"]
[2,5,"Impianti e/o bacini per fitodepurazione",5,"X"]
{"$rows_left_out":34}
{"sheet":"Categoria investimenti","index":14,"n_rows":10,"n_cols":2,"rows_kept":10,"cut":false,"hidden":true,"merged":[]}
["Codice","Categoria degli investimenti"]
[1,"Terreni"]
[2,"Miglioramenti fondiari"]
[3,"Impianti produzione energia"]
[4,"Beni Immobili produttivi"]
[5,"Investimenti per nuove norme comunitarie"]
[6,"Macchine, Impianti e attrezzature"]
[7,"Investimenti Immateriali"]
{"$rows_left_out":2}